{"text_format":"1","workbook":"xlsx","n_sheets":8,"sheets":["Instructions","MCFV TCO Dashboard","Summary","Currency","Capital Cost","Operational Cost","Financing","TCO_1"],"not_rendered":{"charts":6,"images":10,"macros":0,"external_links":1,"defined_names":0,"comments":0,"pivot_tables":0},"unopened":[],"bounds":{"document_bytes":16777216,"sheet_cells":100000,"rows_first":2000,"rows_last":500,"rows_between":2000,"halvings":0,"cell_chars":16384,"cell_head_chars":4096},"cells_cut":0,"cells_raw":0,"read":"whole","date_system":"1900"}

{"sheet":"Instructions","index":0,"n_rows":43,"n_cols":6,"rows_kept":43,"cut":false,"hidden":false,"merged":[[35,1,35,3],[35,5,35,13],[22,1,22,13],[33,1,33,3],[33,5,33,13],[34,1,34,3],[34,5,34,13],[23,1,23,3],[23,5,23,13],[30,1,30,3],[30,5,30,13],[31,1,31,3],[31,5,31,13],[32,5,32,13],[27,1,27,3],[27,5,27,13],[11,1,11,3],[1,1,1,13],[3,1,3,13],[26,5,26,13],[29,5,29,13],[12,1,12,3],[11,5,13,13],[15,5,15,13],[16,5,16,13],[17,5,17,13],[20,1,20,3],[20,5,20,13],[21,1,21,3],[21,5,21,13],[5,1,5,8],[14,1,14,13],[15,1,15,3],[16,1,16,3],[9,1,9,3],[10,1,10,3],[9,5,9,13],[8,5,8,13],[10,5,10,13],[8,1,8,3],[42,1,43,14],[29,1,29,3],[17,1,17,3],[18,1,18,3],[24,1,24,3],[25,1,25,3],[26,1,26,3],[18,5,18,13],[24,5,24,13],[25,5,25,13],[36,5,36,13],[32,1,32,3],[36,1,36,3],[28,1,28,13],[19,1,19,3],[19,5,19,13]]}
[]
[null,"HOW TO USE THE DYNAMIC TOTAL COST OF OWNERSHIP DASHBOARD"]
[]
[null,"All cells highlighted Green are Input cells. Values can only be edited in these cells to observe the dynamic changes in the dashboard on the right."]
[]
[null,"All cells highlighted Gray are Fixed cells. These values cannot be edited."]
[]
[]
[null,"CELL NAME",null,null,"FUNCTION","ACTION REQUIRED"]
[null,"Vehicle Holding Period (Year)",null,null,"Editable","Use the drop down menu on Cell C5 to choose the Vehicle holding period from 1 to 10 years "]
[null,"Daily Distance Travelled (km)",null,null,"Editable","Use the arrows on the right to increase/decrease to input Daily Distance Travelled in km"]
[null,"Daily Distance Travelled (mi)",null,null,"Fixed"]
[null,"Annual Distance Travelled (km)",null,null,"Fixed"]
[null,"Annual Distance Travelled (mi)",null,null,"Fixed"]
[null,"`"]
{"$rows_left_out":29}
{"sheet":"MCFV TCO Dashboard","index":1,"n_rows":72,"n_cols":48,"rows_kept":72,"cut":false,"hidden":false,"merged":[[2,1,2,3],[14,3,14,5],[16,2,16,5],[4,3,4,5]]}
[null,null,null,null,null,null,null,null,null,null,null,null,null,null,null,null,null,null,null,null,null,null,null,null,null,null,null,null,null,null,null,null,null,null,null,null,"10 YEAR","TCO",null,null,null,null,null,"DYNAMIC","TCO"]
[null,null,null,null,null,null,null,null,null,null,null,null,null,null,null,null,null,null,null,null,null,null,null,null,null,null,null,null,null,null,null,null,null,null,null,null,"e-MCFV (LT)",{"$f":"TCO_1!C11","v":23.528736909428694},null,null,null,null,null,"e-MCFV (LT)",{"$f":"VLOOKUP($C$5,$AR$10:$AV$20,2,0)","v":33.836595304065575}]
[null,null,null,null,null,null,null,null,null,null,null,null,null,null,null,null,null,null,null,null,null,null,null,null,null,null,null,null,null,null,null,null,null,null,null,null,"e-MCFV (HT)",{"$f":"TCO_1!D11","v":37.993654400171053},null,null,null,null,null,"e-MCFV (HT)",{"$f":"VLOOKUP($C$5,$AR$10:$AV$20,3,0)","v":54.892346632701212}]
[null,null,null,null,null,null,null,null,null,null,null,null,null,null,null,null,null,null,null,null,null,null,null,null,null,null,null,null,null,null,null,null,null,null,null,null,"Diesel - MCFV",{"$f":"TCO_1!E11","v":27.275995111972019},null,null,null,null,null,"Diesel - MCFV",{"$f":"VLOOKUP($C$5,$AR$10:$AV$20,4,0)","v":36.729253391039897}]
[null,"Vehicle Holding Period (Year)",5,"              Use Drop down to choose Holding Period",null,null,null,null,null,null,null,null,null,null,null,null,null,null,null,null,null,null,null,null,null,null,null,null,null,null,null,null,null,null,null,null,"CNG - MCFV",{"$f":"TCO_1!F11","v":19.971051125837267},null,null,null,null,null,"CNG - MCFV",{"$f":"VLOOKUP($C$5,$AR$10:$AV$20,5,0)","v":27.561141703158675}]
[]
[null,"Daily Distance Travelled (km)",200,null,"(Use Arrows to input Distance)"]
[null,"Daily Distance Travelled (mi)",{"$f":"C7*0.621371","v":124.27420000000001}]
[]
[null,"Annual Distance Travelled (km)",{"$f":"C7*315","v":63000},null,null,null,null,null,null,null,null,null,null,null,null,null,null,null,null,null,null,null,null,null,null,null,null,null,null,null,null,null,null,null,null,null,"Operational Years","e-MCFV (LT)","e-MCFV (HT)","Diesel - MCFV","CNG - MCFV",null,null,null,"e-MCFV (LT)","e-MCFV (HT)","Diesel - MCFV","CNG - MCFV"]
[null,"Annual Distance Travelled (mi)",{"$f":"C8*315","v":39146.373},null,null,null,null,null,null,null,null,null,null,null,null,null,null,null,null,null,null,null,null,null,null,null,null,null,null,null,null,null,null,null,null,null,"Year 1",{"$f":"TCO_1!C31","v":104.18671108954572},{"$f":"TCO_1!C34","v":171.7560589827564},{"$f":"TCO_1!C37","v":83.822523921819837},{"$f":"TCO_1!C40","v":70.82629539846333},null,null,1,{"$f":"IF($C$5=AR11,AL11:AO11,)","v":0}]
[null,null,null,null,null,null,null,null,null,null,null,null,null,null,null,null,null,null,null,null,null,null,null,null,null,null,null,null,null,null,null,null,null,null,null,null,"Year 2",{"$f":"TCO_1!D31","v":60.884658581571635},{"$f":"TCO_1!D34","v":99.728642329417141},{"$f":"TCO_1!D37","v":55.918661147042236},{"$f":"TCO_1!D40","v":44.726259709210808},null,null,2,{"$f":"IF($C$5=AR12,AL12:AO12,)","v":0}]
[null,null,null,null,null,null,null,null,null,null,null,null,null,null,null,null,null,null,null,null,null,null,null,null,null,null,null,null,null,null,null,null,null,null,null,null,"Year 3",{"$f":"TCO_1!E31","v":46.13308564251497},{"$f":"TCO_1!E34","v":75.236961522845817},{"$f":"TCO_1!E37","v":45.893235032826666},{"$f":"TCO_1!E40","v":35.580328286507864},null,null,3,{"$f":"IF($C$5=AR13,AL13:AO13,)","v":0}]
[null,null,null,null,null,null,null,null,null,null,null,null,null,null,null,null,null,null,null,null,null,null,null,null,null,null,null,null,null,null,null,null,null,null,null,null,"Year 4",{"$f":"TCO_1!F31","v":38.543570523248988},{"$f":"TCO_1!F34","v":62.66675502563519},{"$f":"TCO_1!F37","v":40.388530901425945},{"$f":"TCO_1!F40","v":30.704978677579696},null,null,4,{"$f":"IF($C$5=AR14,AL14:AO14,)","v":0}]
[null,null,"INR",null,null,null,null,null,null,null,null,null,null,null,null,null,null,null,null,null,null,null,null,null,null,null,null,null,null,null,null,null,null,null,null,null,"Year 5",{"$f":"TCO_1!G31","v":33.836595304065575},{"$f":"TCO_1!G34","v":54.892346632701212},{"$f":"TCO_1!G37","v":36.729253391039897},{"$f":"TCO_1!G40","v":27.561141703158675},null,null,5,{"$f":"IF($C$5=AR15,AL15:AO15,)","v":33.836595304065575},54.892346632701212,36.729253391039897,27.561141703158675]
{"$rows_left_out":58}
{"sheet":"Summary","index":2,"n_rows":30,"n_cols":5,"rows_kept":30,"cut":false,"hidden":false,"merged":[[0,0,0,1],[11,0,11,4],[19,0,19,4],[27,0,27,4]]}
["TRAVEL DETAILS"]
["Number of Vehicle",1]
["Life of Vehicle (yrs)",10]
["Annual drive distance (KM)",{"$f":"'MCFV TCO Dashboard'!C10","v":63000}]
["Total Distance Travel (KM)",{"$f":"B3*B4","v":630000}]
["LIB Cost (USD/kWh)",{"$f":"'MCFV TCO Dashboard'!C40","v":137}]
["USD to INR",73]
["VRLA Cost (USD/kWh)",100]
["General Inputs","e-MCFV (LT)","e-MCFV (HT)","Diesel - MCFV","CNG - MCFV"]
["Discount rate (%)",{"$f":"'MCFV TCO Dashboard'!C25","v":0.1},{"$f":"'MCFV TCO Dashboard'!D25","v":0.1},{"$f":"'MCFV TCO Dashboard'!E25","v":0.1},{"$f":"'MCFV TCO Dashboard'!F25","v":0.1}]
["Resale rate (%)",{"$f":"'MCFV TCO Dashboard'!C26","v":0.2},{"$f":"'MCFV TCO Dashboard'!D26","v":0.2},{"$f":"'MCFV TCO Dashboard'!E26","v":0.1},{"$f":"'MCFV TCO Dashboard'!F26","v":0.1}]
[]
["Capital Cost","e-MCFV (LT)","e-MCFV (HT)","Diesel - MCFV","CNG - MCFV"]
["Total Vehicle Cost (₹)",{"$f":"'Capital Cost'!B8","v":4451877.6275078757},{"$f":"'Capital Cost'!C8","v":7253701.9065707345},{"$f":"'Capital Cost'!D8","v":3563377.1888928344},{"$f":"'Capital Cost'!E8","v":3383965.7010122831}]
["Resale Value (₹)",{"$f":"B14*B11","v":890375.5255015752},{"$f":"C14*C11","v":1450740.381314147},{"$f":"D14*D11","v":356337.71888928348},{"$f":"E14*E11","v":338396.57010122831}]
{"$rows_left_out":16}
{"sheet":"Currency","index":3,"n_rows":55,"n_cols":12,"rows_kept":55,"cut":false,"hidden":true,"merged":[[1,1,1,3],[15,1,15,2],[15,4,15,5],[15,7,15,8],[15,10,15,11]]}
[]
[null,"CURRENCY CONVERSION"]
[]
[null,"USD","INR","Conversion"]
[null,1,73,{"$f":"B5*C5","v":73}]
[]
[null,"EURO","INR","Conversion"]
[null,1,82,{"$f":"B8*C8","v":82}]
[]
[]
[]
[]
[]
[]
[]
{"$rows_left_out":41}
{"sheet":"Capital Cost","index":4,"n_rows":43,"n_cols":5,"rows_kept":43,"cut":false,"hidden":true,"merged":[[49,0,49,4],[24,0,24,4],[29,0,29,4],[34,0,34,4],[39,0,39,4],[44,0,44,4]]}
["Vehicle Cost","e-MCFV (LT)","e-MCFV (HT)","Diesel - MCFV","CNG - MCFV"]
["Purchase Cost (₹)",{"$f":"VLOOKUP('MCFV TCO Dashboard'!$C$15,'Capital Cost'!$A$26:$E$28,2,0)","v":3500000},{"$f":"VLOOKUP('MCFV TCO Dashboard'!$C$15,'Capital Cost'!$A$26:$E$28,3,0)","v":5436900},{"$f":"VLOOKUP('MCFV TCO Dashboard'!$C$15,'Capital Cost'!$A$26:$E$28,4,0)","v":2589000},{"$f":"VLOOKUP('MCFV TCO Dashboard'!$C$15,'Capital Cost'!$A$26:$E$28,5,0)","v":2456000}]
["Tax (₹)",{"$f":"VLOOKUP('MCFV TCO Dashboard'!$C$15,'Capital Cost'!$A$31:$E$33,2,0)","v":0},{"$f":"VLOOKUP('MCFV TCO Dashboard'!$C$15,'Capital Cost'!$A$31:$E$33,3,0)","v":0},{"$f":"VLOOKUP('MCFV TCO Dashboard'!$C$15,'Capital Cost'!$A$31:$E$33,4,0)","v":19054},{"$f":"VLOOKUP('MCFV TCO Dashboard'!$C$15,'Capital Cost'!$A$31:$E$33,5,0)","v":20500}]
["Insurance (₹)",{"$f":"VLOOKUP('MCFV TCO Dashboard'!$C$15,'Capital Cost'!$A$36:$E$38,2,0)","v":72000},{"$f":"VLOOKUP('MCFV TCO Dashboard'!$C$15,'Capital Cost'!$A$36:$E$38,3,0)","v":450000},{"$f":"VLOOKUP('MCFV TCO Dashboard'!$C$15,'Capital Cost'!$A$36:$E$38,4,0)","v":37192},{"$f":"VLOOKUP('MCFV TCO Dashboard'!$C$15,'Capital Cost'!$A$36:$E$38,5,0)","v":36500}]
["Financing Component (₹)",{"$f":"Financing!B17","v":879877.62750787567},{"$f":"Financing!C17","v":1366801.9065707345},{"$f":"Financing!D17","v":918131.18889283435},{"$f":"Financing!E17","v":870965.7010122831}]
["Total Financial Incentive (₹)",0,0,0,0]
["Misc. Cost (₹)",0,0,0,0]
["Total Vehicle Cost (₹)",{"$f":"((B2+B3+B4+B5+B7)-B6)","v":4451877.6275078757},{"$f":"((C2+C3+C4+C5+C7)-C6)","v":7253701.9065707345},{"$f":"((D2+D3+D4+D5+D7)-D6)","v":3563377.1888928344},{"$f":"((E2+E3+E4+E5+E7)-E6)","v":3383965.7010122831}]
[]
["Charging Infrastructure Cost","e-MCFV (LT)","e-MCFV (HT)","Diesel - MCFV","CNG - MCFV"]
["No. of Slow Charger (SC)",1,0,0,0]
["Cost of SC per unit (₹)",900000,800000,0,0]
["Total Cost of SC (₹)",{"$f":"B11*B12","v":900000},{"$f":"C11*C12","v":0},{"$f":"D11*D12","v":0},0]
["No. of Fast Charger (FC)",0.2,1,0,0]
["Cost of FC per unit (₹)",1800000,2200000,0,0]
{"$rows_left_out":29}
{"sheet":"Operational Cost","index":5,"n_rows":47,"n_cols":5,"rows_kept":47,"cut":false,"hidden":true,"merged":[[33,0,33,4],[38,0,38,4],[43,0,43,4]]}
["Staff cost","e-MCFV (LT)","e-MCFV (HT)","Diesel - MCFV","CNG - MCFV"]
["Staff Cost (₹ / Month)",{"$f":"'MCFV TCO Dashboard'!C39","v":50000},{"$f":"'MCFV TCO Dashboard'!C39","v":50000},{"$f":"'MCFV TCO Dashboard'!C39","v":50000},{"$f":"'MCFV TCO Dashboard'!C39","v":50000}]
["Other Support staff cost (₹ / Month)",0,0,0,0]
["Total Annual Staff Cost (₹)",{"$f":"((B2+B3)*12)","v":600000},{"$f":"((C2+C3)*12)","v":600000},600000,600000]
["Per km Staff Cost",{"$f":"B4/Summary!$B$4","v":9.5238095238095237},{"$f":"C4/Summary!$B$4","v":9.5238095238095237},{"$f":"D4/Summary!$B$4","v":9.5238095238095237},{"$f":"E4/Summary!$B$4","v":9.5238095238095237}]
[]
["Average Fuel Cost","e-MCFV (LT)","e-MCFV (HT)","Diesel - MCFV","CNG - MCFV"]
["Fuel cost (₹/kWh; ₹/L;  ₹/kg)",{"$f":"VLOOKUP('MCFV TCO Dashboard'!$C$15,'Operational Cost'!$A$45:$E$47,2,0)","v":6},{"$f":"VLOOKUP('MCFV TCO Dashboard'!$C$15,'Operational Cost'!$A$45:$E$47,3,0)","v":6},{"$f":"VLOOKUP('MCFV TCO Dashboard'!$C$15,'Operational Cost'!$A$45:$E$47,4,0)","v":89},{"$f":"VLOOKUP('MCFV TCO Dashboard'!$C$15,'Operational Cost'!$A$45:$E$47,5,0)","v":43}]
["Mileage (km/kWh; km/L; km/kg)",{"$f":"'MCFV TCO Dashboard'!C46","v":1.76},{"$f":"'MCFV TCO Dashboard'!D46","v":0.8},{"$f":"'MCFV TCO Dashboard'!E46","v":4.5},{"$f":"'MCFV TCO Dashboard'!F46","v":5}]
["Annual fuel consumption (kWh; L; kg)",{"$f":"Summary!B4/B9","v":35795.454545454544},{"$f":"Summary!B4/C9","v":78750},{"$f":"Summary!B4/D9","v":14000},{"$f":"Summary!$B$4/E9","v":12600}]
["Total Annual Fuel Cost ( ₹ )",{"$f":"(B10*B8)","v":214772.72727272726},{"$f":"(C10*C8)","v":472500},{"$f":"(D10*D8)","v":1246000},{"$f":"(E10*E8)","v":541800}]
["Per km Fuel Cost",{"$f":"B11/Summary!$B$4","v":3.4090909090909092},{"$f":"C11/Summary!$B$4","v":7.5},{"$f":"D11/Summary!$B$4","v":19.777777777777779},{"$f":"E11/Summary!$B$4","v":8.6}]
[]
["Maintenance Cost","e-MCFV (LT)","e-MCFV (HT)","Diesel - MCFV","CNG - MCFV"]
["Annual Maintenance Cost (₹)",{"$f":"VLOOKUP('MCFV TCO Dashboard'!$C$15,'Operational Cost'!$A$40:$E$42,2,0)","v":17250},{"$f":"VLOOKUP('MCFV TCO Dashboard'!$C$15,'Operational Cost'!$A$40:$E$42,3,0)","v":21500},{"$f":"VLOOKUP('MCFV TCO Dashboard'!$C$15,'Operational Cost'!$A$40:$E$42,4,0)","v":43186},{"$f":"VLOOKUP('MCFV TCO Dashboard'!$C$15,'Operational Cost'!$A$40:$E$42,5,0)","v":44100}]
{"$rows_left_out":33}
{"sheet":"Financing","index":6,"n_rows":24,"n_cols":5,"rows_kept":24,"cut":false,"hidden":true,"merged":[[20,0,20,4],[25,0,25,4]]}
["Vehicle Cost","e-MCFV (LT)","e-MCFV (HT)","Diesel - MCFV","CNG - MCFV"]
["Total Cost of MCFV (₹)",{"$f":"'MCFV TCO Dashboard'!C20-'MCFV TCO Dashboard'!C23","v":3500000},{"$f":"'MCFV TCO Dashboard'!D20","v":5436900},{"$f":"'MCFV TCO Dashboard'!E20","v":2589000},{"$f":"'MCFV TCO Dashboard'!F20","v":2456000}]
["Share of Operator (%)",{"$f":"100%-B6","v":0.8},{"$f":"100%-C6","v":0.8},0.8,0.8]
["Share of Operator (₹)",{"$f":"B3*B2","v":2800000},{"$f":"C3*C2","v":4349520},{"$f":"D3*D2","v":2071200},{"$f":"E3*E2","v":1964800}]
["Processing  Fees",{"$f":"IF(B8=0,0,IF(B4*0.5%>500,B4*0.5%,500))","v":14000},{"$f":"IF(C8=0,0,IF(C4*0.5%>500,C4*0.5%,500))","v":21747.600000000002},10356,9824]
["Equity %",{"$f":"'MCFV TCO Dashboard'!C31","v":0.2},{"$f":"'MCFV TCO Dashboard'!D31","v":0.2},{"$f":"'MCFV TCO Dashboard'!E31","v":0.2},{"$f":"'MCFV TCO Dashboard'!F31","v":0.2}]
["Equity (₹)",{"$f":"(B6*B2)","v":700000},{"$f":"(C6*C2)","v":1087380},{"$f":"(D6*D2)","v":517800},{"$f":"(E6*E2)","v":491200}]
["Loan amount (₹)",{"$f":"B4","v":2800000},{"$f":"C4","v":4349520},{"$f":"D4","v":2071200},{"$f":"E4","v":1964800}]
["Interest rate (%)",{"$f":"'MCFV TCO Dashboard'!C30","v":0.08},{"$f":"'MCFV TCO Dashboard'!D30","v":0.08},{"$f":"'MCFV TCO Dashboard'!E30","v":0.11},{"$f":"'MCFV TCO Dashboard'!F30","v":0.11}]
["Term of payment (yrs)",{"$f":"'MCFV TCO Dashboard'!C29","v":7},{"$f":"'MCFV TCO Dashboard'!D29","v":7},{"$f":"'MCFV TCO Dashboard'!E29","v":7},{"$f":"'MCFV TCO Dashboard'!F29","v":7}]
["No of EMI (Yearly)",{"$f":"B10*12","v":84},{"$f":"C10*12","v":84},84,84]
["Monthly EMI Loan (Rs.)",{"$f":"((PMT(B9/12,B10*12,-B8))+(B5/B11))","v":43808.06699414138},{"$f":"((PMT(C9/12,C10*12,-C8))+(C5/C11))","v":68051.451268699224},35587.276058248026,33759.115488241463]
["Total interest paid",{"$f":"(B12*B10*12)-B8","v":879877.62750787567},{"$f":"(C12*C10*12)-C8","v":1366801.9065707345},918131.18889283435,870965.7010122831]
["Yearly Interest Paid",{"$f":"B13/B10","v":125696.80392969653},{"$f":"C13/C10","v":195257.41522439063},{"$f":"D13/D10","v":131161.59841326205},{"$f":"E13/E10","v":124423.6715731833}]
["EMI per KM (Rs.)",{"$f":"B14/Summary!B4","v":1.995187363963437},{"$f":"C14/Summary!B4","v":3.0993240511808038},{"$f":"D14/Summary!B4","v":2.081930133543842},{"$f":"E14/Summary!B4","v":1.9749789138600524}]
{"$rows_left_out":10}
{"sheet":"TCO_1","index":7,"n_rows":40,"n_cols":13,"rows_kept":40,"cut":false,"hidden":true,"merged":[]}
["Parameter","Unit","e-MCFV (LT)","e-MCFV (HT)","Diesel - MCFV","CNG - MCFV"]
["Discount rate value","-",{"$f":"Summary!B10","v":0.1},{"$f":"Summary!C10","v":0.1},{"$f":"Summary!D10","v":0.1},{"$f":"Summary!E10","v":0.1}]
["Resale rate value","-",{"$f":"Summary!B11","v":0.2},{"$f":"Summary!C11","v":0.2},{"$f":"Summary!D11","v":0.1},{"$f":"Summary!E11","v":0.1}]
["Capital recovery factor (CRF)_N","-",{"$f":"C2*(1+C2)^Summary!B3","v":0.2593742460100002},{"$f":"D2*(1+D2)^Summary!B3","v":0.2593742460100002},{"$f":"E2*(1+E2)^Summary!B3","v":0.2593742460100002},{"$f":"F2*(1+F2)^Summary!B3","v":0.2593742460100002}]
["Capital recovery factor (CRF)_D","-",{"$f":"((1+C2)^Summary!B3)-1","v":1.5937424601000019},{"$f":"(1+D2)^Summary!B3-1","v":1.5937424601000019},{"$f":"(1+E2)^Summary!B3-1","v":1.5937424601000019},{"$f":"(1+F2)^Summary!B3-1","v":1.5937424601000019}]
["CRF","-",{"$f":"C4/C5","v":0.16274539488251155},{"$f":"D4/D5","v":0.16274539488251155},{"$f":"E4/E5","v":0.16274539488251155},{"$f":"F4/F5","v":0.16274539488251155}]
["Present value factor (PVF)","-",{"$f":"1/(1+C2)^10","v":0.38554328942953148},{"$f":"1/(1+D2)^Summary!B3","v":0.38554328942953148},{"$f":"1/(1+E2)^Summary!B3","v":0.38554328942953148},{"$f":"1/(1+F2)^Summary!B3","v":0.38554328942953148}]
["Residual value (RV)","₹",{"$f":"Summary!B14*C3","v":890375.5255015752},{"$f":"Summary!C14*D3","v":1450740.381314147},{"$f":"Summary!D14*E3","v":356337.71888928348},{"$f":"Summary!E14*F3","v":338396.57010122831}]
["Annual  Travel Distance","km",{"$f":"Summary!$B$4","v":63000},{"$f":"Summary!$B$4","v":63000},{"$f":"Summary!$B$4","v":63000},{"$f":"Summary!$B$4","v":63000}]
["Capex component","₹",{"$f":"((Summary!B19-(C8*C7))*C6)","v":924979.6154560236},{"$f":"(Summary!C19-(D8*D7))*D6","v":1537029.1389742265},{"$f":"(Summary!D19-(E8*E7))*E6","v":557564.67683845677},{"$f":"(Summary!E19-(F8*F7))*F6","v":529492.00786222995}]
["TCO","₹/km",{"$f":"(C10+L22)/C9","v":23.528736909428694},{"$f":"(D10+L23)/D9","v":37.993654400171053},{"$f":"(E10+L24)/E9","v":27.275995111972019},{"$f":"(F10+L25)/F9","v":19.971051125837267}]
[]
["Opex / year"]
["Vehicle type","Unit",1,{"$f":"C14+1","v":2},3,4,5,6,7,8,9,10,"Total"]
["e-MCFV (LT)","₹",{"$f":"Summary!$B$27/(1+$C$2)^C14","v":824572.9338842975},{"$f":"Summary!$B$27/(1+$C$2)^D14","v":749611.75807663403},{"$f":"Summary!$B$27/(1+$C$2)^E14","v":681465.23461512174},{"$f":"Summary!$B$27/(1+$C$2)^F14","v":619513.8496501107},{"$f":"Summary!$B$27/(1+$C$2)^G14","v":563194.40877282782},{"$f":"Summary!$B$27/(1+$C$2)^H14","v":511994.9170662071},{"$f":"Summary!$B$27/(1+$C$2)^I14","v":465449.92460564274},{"$f":"Summary!$B$27/(1+$C$2)^J14","v":423136.2950960389},{"$f":"Summary!$B$27/(1+$C$2)^K14","v":384669.35917821713},{"$f":"Summary!$B$27/(1+$C$2)^L14","v":349699.41743474279},{"$f":"SUM(C15:L15)/Summary!B3","v":557330.80983798404}]
{"$rows_left_out":25}